[ATMEGA328P®/AVR®/ASM]MPLAB X IDE编译错误

[复制链接]
1484|0
手机看帖
扫描二维码
随时随地手机跟帖
面包超人tutka|  楼主 | 2024-5-19 05:54 | 显示全部楼层 |阅读模式
学校这学期要求用这个软件写ASM,老师给了一些他写的ASM.但是运行起来还是报错.大神们可以看看是什么问题吗!!!非常感谢!!!!
make -f nbproject/Makefile-default.mk SUBPROJECTS= .build-conf
make  -f nbproject/Makefile-default.mk dist/default/debug/main.X.debug.elf
make[2]: *** No rule to make target 'build/default/debug/_ext/1199933227/PWM - main.o', needed by 'dist/default/debug/main.X.debug.elf'.  Stop.
make[1]: *** [nbproject/Makefile-default.mk:85: .build-conf] Error 2
make: *** [nbproject/Makefile-impl.mk:39: .build-impl] Error 2

BUILD FAILED (exit value 2, total time: 113ms)


使用特权

评论回复

相关帖子

发新帖 我要提问
您需要登录后才可以回帖 登录 | 注册

本版积分规则

3

主题

4

帖子

0

粉丝